{"text_format":"1","workbook":"xlsx","n_sheets":5,"sheets":["様式１増","申請者入力","リスト","様式１増_手書き","扶養（増）記入例"],"not_rendered":{"charts":0,"images":3,"macros":1,"external_links":1,"defined_names":17,"comments":0,"pivot_tables":0},"unopened":[],"bounds":{"document_bytes":16777216,"sheet_cells":100000,"rows_first":2000,"rows_last":500,"rows_between":2000,"halvings":0,"cell_chars":16384,"cell_head_chars":4096},"cells_cut":0,"cells_raw":0,"read":"whole","date_system":"1900"}

{"sheet":"様式１増","index":0,"n_rows":61,"n_cols":57,"rows_kept":61,"cut":false,"hidden":true,"merged":[[44,26,46,56],[47,26,52,56],[54,27,55,56],[56,12,58,23],[56,27,56,56],[58,26,59,56],[60,26,60,45],[60,51,60,56],[9,39,9,41],[51,2,51,25],[30,44,36,44],[52,2,52,25],[47,1,50,25],[44,1,46,25],[29,45,29,46],[19,1,19,7],[30,45,36,45],[37,50,43,50],[37,51,43,51],[20,2,24,2],[20,3,24,3],[20,4,24,4],[36,28,36,31],[43,26,43,27],[7,39,7,41],[25,14,25,20],[28,28,29,32],[34,26,35,27],[30,14,31,20],[11,39,11,41],[13,39,13,41],[8,25,8,26],[30,26,31,27],[30,28,31,31],[20,38,20,39],[20,41,20,42],[23,38,23,39],[30,33,31,34],[33,12,33,25],[35,12,35,25],[25,12,26,13],[32,32,33,32],[16,0,16,36],[13,30,13,31],[20,16,24,17],[30,32,31,32],[20,5,24,5],[20,6,24,6],[0,39,0,56],[5,39,5,41],[11,54,12,55],[25,44,28,50],[25,51,29,56],[26,15,26,16],[26,17,26,18],[20,24,24,36],[25,33,29,43],[21,37,21,56],[8,21,8,22],[8,23,8,24],[24,37,24,55],[22,37,22,56],[28,11,29,25],[25,21,26,25],[25,26,27,32],[23,49,23,56],[19,37,19,56],[6,19,7,26],[7,27,11,28],[8,19,8,20],[9,19,12,20],[20,8,24,15],[30,50,36,50],[30,51,36,51],[30,47,36,47],[20,18,24,23],[27,11,27,25],[29,49,29,50],[29,47,29,48],[30,1,31,5],[19,18,19,23],[32,1,36,5],[32,11,33,11],[34,11,35,11],[36,11,36,13],[32,6,36,10],[32,26,33,27],[30,46,36,46],[32,17,32,25],[36,26,36,27],[32,15,32,16],[34,15,34,16],[30,49,36,49],[19,8,19,17],[23,41,23,42],[28,26,29,27],[1,0,2,6],[1,7,2,38],[1,39,1,56],[4,0,4,11],[4,13,4,17],[4,19,5,37],[4,50,4,56],[5,0,5,3],[5,4,5,7],[5,8,5,11],[2,50,2,56],[28,1,28,10],[30,11,31,11],[30,12,31,13],[20,1,24,1],[19,24,19,36],[37,45,43,45],[43,11,43,13],[37,14,38,20],[37,1,38,5],[37,6,38,10],[37,11,38,11],[39,1,43,5],[39,6,43,10],[41,28,42,31],[40,12,40,25],[42,12,42,25],[39,15,39,16],[41,15,41,16],[25,11,26,11],[37,12,38,13],[34,28,35,31],[30,6,31,10],[37,46,43,46],[34,32,35,32],[43,28,43,31],[37,26,38,27],[39,17,39,25],[39,26,40,27],[41,26,42,27],[37,21,38,25],[20,7,24,7],[25,1,27,10],[26,19,26,20],[30,21,31,25],[42,35,43,43],[39,11,40,11],[41,11,42,11],[41,32,42,32],[39,32,40,32],[37,44,43,44],[37,33,38,34],[39,28,40,31],[30,35,41,43],[32,28,33,31],[29,1,29,5],[29,6,29,10],[17,34,17,36],[17,0,17,32],[34,17,34,25],[30,48,36,48],[16,39,16,56],[17,39,17,54],[12,39,12,41],[13,0,14,15],[19,0,59,0],[53,26,53,56],[57,26,57,56],[54,1,55,25],[30,52,30,56],[31,52,36,56],[37,52,37,56],[38,52,43,56],[32,33,36,34],[39,33,43,34],[37,48,43,48],[37,49,43,49],[37,47,43,47],[41,17,41,25],[37,28,38,31],[37,32,38,32]]}
[null,null,null,null,null,null,null,null,null,null,null,null,null,null,null,null,null,null,null,null,null,null,null,null,null,null,null,null,null,null,null,null,null,null,null,null,null,null,null,"事 業 主 （ 事 業 主 代 理 人 ） 記 入 箇 所"]
["取扱注意",null,null,null,null,null,null,"　　　健康保険被扶養者異動届（扶養するとき）",null,null,null,null,null,null,null,null,null,null,null,null,null,null,null,null,null,null,null,null,null,null,null,null,null,null,null,null,null,null,null,"下記の通り被保険者から被扶養者の届出がありましたので提出します。"]
[null,null,null,null,null,null,null,null,null,null,null,null,null,null,null,null,null,null,null,null,null,null,null,null,null,null,null,null,null,null,null,null,null,null,null,null,null,null,null,null,null,null,null,null,null,null,null,null,null,null,"　　　令和　　　　　年　　　　　月　　　　　日　　提出"]
[null,null,null,null,null,null,null,null,null,null,null,null,null,null,null,null,null,null,null,null,null,null,null,null,null,null,null,null,null,null,null,null,null,null,null,null,null,null,null,null,null,null,null,"〒　　　　　　　　－"]
["健 康 保 険 組 合",null,null,null,null,null,null,null,null,null,null,null,null,"健保受付",null,null,null,null,null,"健　康　保　険　組　合　　記　入　欄"]
["　　　　長",null,null,null,"　　　　長",null,null,null,"担当者"]
[null,null,null,null,null,null,null,null,null,null,null,null,null,null,null,null,null,null,null,"異動年月日"]
[null,null,null,null,null,null,null,null,null,null,null,null,null,null,null,null,null,null,null,null,null,null,null,null,null,null,null,"補\n記\n事\n項",null,null,null,null,null,null,null,null,null,null,null,"事業所所在地"]
[null,null,null,null,null,null,null,null,null,null,null,null,null,null,null,null,null,null,null,"号",null,"年",null,"月",null,"日"]
[null,null,null,null,null,null,null,null,null,null,null,null,null,null,null,null,null,null,null,"Ｈ\n\nＲ",null,null,null,null,null,null,null,null,null,null,null,null,null,null,null,null,null,null,null,"事業所名称"]
[]
[null,null,null,null,null,null,null,null,null,null,null,null,null,null,null,null,null,null,null,null,null,null,null,null,null,null,null,null,null,null,null,null,null,null,null,null,null,null,null,"事業主氏名"]
[]
["関西電力健康保険組合　常務理事　殿",null,null,null,null,null,null,null,null,null,null,null,null,null,null,null,null,null,null,null,null,null,"万円","×",null,null,"＝",null,null,null,"万円",null,"/2＝",null,null,null,null,null,null,"電話番号"]
[]
[]
["※１（押印省略）自署の場合または確認欄の要件に該当し☑を入れた場合は、押印を省略できます。",null,null,null,null,null,null,null,null,null,null,null,null,null,null,null,null,null,null,null,null,null,null,null,null,null,null,null,null,null,null,null,null,null,null,null,null,null,null,"事業主確認欄（以下の内容に該当する場合は、事業主にて確認し☑願います）"]
["この届出については、①または②の要件を満たしたものです。\n①申請者本人（被保険者）が作成したものです。②記載内容について誤りがないか申請者本人が確認しています。",null,null,null,null,null,null,null,null,null,null,null,null,null,null,null,null,null,null,null,null,null,null,null,null,null,null,null,null,null,null,null,null,"確認欄","□",null,null,null,null,"　被保険者との続柄に関する証明書類が省略されている者については、続柄を確認しています。（内縁関係は省略不可）",null,null,null,null,null,null,null,null,null,null,null,null,null,null,null,"確認欄","□"]
[]
["被\n\n保\n\n険\n\n者\n\n記\n\n入\n\n欄","被 保 険 者 番 号",null,null,null,null,null,null,"被保険者　氏名",null,null,null,null,null,null,null,null,null,"被保険者　生年月日",null,null,null,null,null,"所　属（※任意継続被保険者は記入不要）",null,null,null,null,null,null,null,null,null,null,null,null,"被　保　険　者　住　民　票　住　所"]
{"$rows_left_out":42}
{"sheet":"申請者入力","index":1,"n_rows":82,"n_cols":8,"rows_kept":82,"cut":false,"hidden":false,"merged":[[68,1,85,1],[77,2,80,2],[81,2,82,2],[5,3,5,4],[4,3,4,4],[26,1,45,1],[37,2,40,2],[41,2,42,2],[16,1,19,1],[20,1,23,1],[5,1,5,2],[4,1,4,2],[34,3,34,4],[36,3,36,4],[55,3,55,4],[57,3,57,4],[9,3,9,4],[11,1,15,1],[7,3,7,4],[1,2,1,7],[47,1,66,1],[58,2,61,2],[62,2,63,2]]}
["入力シート"]
[null,null,"１．下記項目（黄色）に入力してください。\n２．入力後、右のボタンをクリックし、届出内容を確認後印刷し、\n　　捺印（用紙中段付近と左下の２箇所）の上、担当箇所へご提出ください。"]
[]
["１．被保険者・共同扶養者情報入力"]
[null,"会社名\n(選択してください)",null,"501．関西電力株式会社",null,"リスト選択",null,{"$f":"IF(VLOOKUP(D5,リスト!$B$75:$F$111,5,0)=1,\"\",1)","v":1}]
[null,"所　　属",null,null,null,"入力"]
[null,null,"住民票住所の郵便番号\n例：０１２（左枠）\n　３４５６ （右枠）",null,null,"入力"]
[null,null,"住民票住所\n",null,null,"入力"]
[null,null,"居所住所の郵便番号\n例：０１２（左枠）\n　３４５６ （右枠）",null,null,"入力"]
[null,null,"居所住所\n※住民票住所と同じ場合は同上とご記入下さい\n",null,null,"入力"]
[]
[null,"被保険者","被保険者番号",null,null,"入力"]
[null,null,"氏名",null,null,"入力"]
[null,null,"生年月日",null,"入力例：「1970/3/3」","入力"]
[null,null,"遡及理由申立",null,"←その他理由を選択される場合のみ変更","リスト"]
[null,null,"その他の理由",null,{"$f":"IF(D15=\"その他（下記余白へ記入して下さい。）\",\"←理由を入力してください。\",\"←入力不要\")","v":"←入力不要"}]
[]
[]
[]
[]
{"$rows_left_out":63}
{"sheet":"リスト","index":2,"n_rows":111,"n_cols":17,"rows_kept":111,"cut":false,"hidden":true,"merged":[[1,10,1,16]]}
[]
[null,"会社名",null,null,null,null,null,null,null,null,"続柄一覧"]
[null,"001.関西電力株式会社",null,null,null,1,null,null,null,null,"名称","名称","名称","名称","名称","名称","名称"]
[null,"002.○○○",null,null,null,0,null,null,null,null,"夫","長男","長女","孫男","祖父","兄","叔父"]
[null,null,null,null,null,null,null,null,null,null,"妻","二男","二女","孫女","祖母","弟","叔母"]
[null,null,null,null,null,null,null,null,null,null,"内夫","三男","三女","孫配偶者男","曽祖父","義兄","甥"]
[null,"性別１",null,null,null,null,null,null,null,null,"内妻","四男","四女","孫配偶者女","曽祖母","義弟","姪"]
[null,"男",{"$f":"IF(申請者入力!D30=\"男\",\"○\",\"\")","v":""},null,null,null,null,null,null,null,null,"五男","五女","父","義祖父","姉","伯父"]
[null,"女",{"$f":"IF(申請者入力!D30=\"女\",\"○\",\"\")","v":""},null,null,null,null,null,null,null,null,"六男","六女","母","義祖母","妹","伯母"]
[null,null,null,null,null,null,null,null,null,null,null,"七男","七女","養父","養祖父","義姉","他親（男）"]
[null,"性別２",null,null,null,null,null,null,null,null,null,"養子","養女","養母","養祖母","義妹","他親（女）"]
[null,"男",{"$f":"IF(申請者入力!D51=\"男\",\"○\",\"\")","v":""},null,null,null,null,null,null,null,null,"子夫","子養","義父"]
[null,"女",{"$f":"IF(申請者入力!D51=\"女\",\"○\",\"\")","v":""},null,null,null,null,null,null,null,null,null,null,"義母"]
[]
[null,"性別３"]
[null,"男",{"$f":"IF(申請者入力!D72=\"男\",\"○\",\"\")","v":""}]
[null,"女",{"$f":"IF(申請者入力!D72=\"女\",\"○\",\"\")","v":""}]
[]
[]
[]
{"$rows_left_out":92}
{"sheet":"様式１増_手書き","index":3,"n_rows":61,"n_cols":57,"rows_kept":61,"cut":false,"hidden":true,"merged":[[39,13,39,16],[24,52,24,56],[23,51,23,56],[53,26,53,56],[54,1,55,25],[57,26,57,56],[51,2,51,25],[52,2,52,25],[38,52,43,56],[37,32,38,32],[37,33,38,34],[37,44,43,44],[37,45,43,45],[37,46,43,46],[43,28,43,31],[44,1,46,25],[39,32,40,32],[39,33,43,34],[40,12,40,25],[41,13,41,16],[41,17,41,25],[41,26,42,27],[47,1,50,25],[39,1,43,5],[39,6,43,10],[39,28,40,31],[30,50,36,50],[30,14,31,20],[30,51,36,51],[30,52,30,56],[31,52,36,56],[39,17,39,25],[39,26,40,27],[42,12,42,25],[37,47,43,47],[42,35,43,43],[32,13,32,16],[32,17,32,25],[32,26,33,27],[32,28,33,31],[30,45,36,45],[30,46,36,46],[30,47,36,47],[43,11,43,13],[37,48,43,48],[37,49,43,49],[37,50,43,50],[37,51,43,51],[39,11,40,11],[43,26,43,27],[41,11,42,11],[32,11,33,11],[41,28,42,31],[41,32,42,32],[37,52,37,56],[32,6,36,10],[30,21,31,25],[33,12,33,25],[34,11,35,11],[34,13,34,16],[34,17,34,25],[35,12,35,25],[30,49,36,49],[30,26,31,27],[30,28,31,31],[30,32,31,32],[36,11,36,13],[36,26,36,27],[36,28,36,31],[30,33,31,34],[30,35,41,43],[30,44,36,44],[32,32,33,32],[32,33,36,34],[34,32,35,32],[37,28,38,31],[34,26,35,27],[34,28,35,31],[30,48,36,48],[37,1,38,5],[37,6,38,10],[37,11,38,11],[37,12,38,13],[30,1,31,5],[30,6,31,10],[30,11,31,11],[30,12,31,13],[32,1,36,5],[37,14,38,20],[37,21,38,25],[37,26,38,27],[25,33,29,43],[25,44,28,50],[25,51,29,56],[26,15,26,16],[26,17,26,18],[26,19,26,20],[27,11,27,25],[29,45,29,46],[29,47,29,48],[29,49,29,50],[25,11,26,11],[25,12,26,13],[25,14,25,20],[25,21,26,25],[25,26,27,32],[20,8,24,15],[20,16,24,17],[28,1,28,10],[28,11,29,25],[28,26,29,27],[28,28,29,32],[29,1,29,5],[29,6,29,10],[25,1,27,10],[16,0,16,36],[16,39,16,56],[17,0,17,32],[17,34,17,36],[17,39,17,54],[19,0,59,0],[19,1,19,7],[19,8,19,17],[19,18,19,23],[19,24,19,36],[20,18,24,23],[20,24,24,36],[20,38,20,42],[21,37,21,56],[22,37,22,56],[23,38,23,42],[19,37,19,56],[20,1,24,1],[20,2,24,2],[20,3,24,3],[20,4,24,4],[20,5,24,5],[20,6,24,6],[20,7,24,7],[1,0,2,6],[1,7,2,38],[1,39,1,56],[2,50,2,56],[4,0,4,11],[4,13,4,17],[4,19,5,37],[4,50,4,56],[5,0,5,3],[5,4,5,7],[5,8,5,11],[5,39,5,41],[44,26,46,56],[47,26,52,56],[54,27,55,56],[56,12,58,23],[56,27,56,56],[58,26,59,56],[60,26,60,45],[60,51,60,56],[0,39,0,56],[9,19,12,20],[9,39,9,41],[11,39,11,41],[11,54,12,55],[12,39,12,41],[13,0,14,15],[13,30,13,31],[13,39,13,41],[6,19,7,26],[7,27,11,28],[7,39,7,41],[8,19,8,20],[8,21,8,22],[8,23,8,24],[8,25,8,26]]}
[null,null,null,null,null,null,null,null,null,null,null,null,null,null,null,null,null,null,null,null,null,null,null,null,null,null,null,null,null,null,null,null,null,null,null,null,null,null,null,"事 業 主 （ 事 業 主 代 理 人 ） 記 入 箇 所"]
["取扱注意",null,null,null,null,null,null,"　　　健康保険被扶養者異動届（扶養するとき）",null,null,null,null,null,null,null,null,null,null,null,null,null,null,null,null,null,null,null,null,null,null,null,null,null,null,null,null,null,null,null,"下記の通り被保険者から被扶養者の届出がありましたので提出します。"]
[null,null,null,null,null,null,null,null,null,null,null,null,null,null,null,null,null,null,null,null,null,null,null,null,null,null,null,null,null,null,null,null,null,null,null,null,null,null,null,null,null,null,null,null,null,null,null,null,null,null,"　　　令和　　　　　年　　　　　月　　　　　日　　提出"]
[null,null,null,null,null,null,null,null,null,null,null,null,null,null,null,null,null,null,null,null,null,null,null,null,null,null,null,null,null,null,null,null,null,null,null,null,null,null,null,null,null,null,null,"〒　　　　　　　　－"]
["健 康 保 険 組 合",null,null,null,null,null,null,null,null,null,null,null,null,"健保受付",null,null,null,null,null,"健　康　保　険　組　合　　記　入　欄"]
["　　　　長",null,null,null,"　　　　長",null,null,null,"担当者"]
[null,null,null,null,null,null,null,null,null,null,null,null,null,null,null,null,null,null,null,"異動年月日"]
[null,null,null,null,null,null,null,null,null,null,null,null,null,null,null,null,null,null,null,null,null,null,null,null,null,null,null,"補\n記\n事\n項",null,null,null,null,null,null,null,null,null,null,null,"事業所所在地"]
[null,null,null,null,null,null,null,null,null,null,null,null,null,null,null,null,null,null,null,"号",null,"年",null,"月",null,"日"]
[null,null,null,null,null,null,null,null,null,null,null,null,null,null,null,null,null,null,null,"Ｈ\n\nＲ",null,null,null,null,null,null,null,null,null,null,null,null,null,null,null,null,null,null,null,"事業所名称"]
[]
[null,null,null,null,null,null,null,null,null,null,null,null,null,null,null,null,null,null,null,null,null,null,null,null,null,null,null,null,null,null,null,null,null,null,null,null,null,null,null,"事業主氏名"]
[]
["関西電力健康保険組合　常務理事　殿",null,null,null,null,null,null,null,null,null,null,null,null,null,null,null,null,null,null,null,null,null,"万円","×",null,null,"＝",null,null,null,"万円",null,"/2＝",null,null,null,null,null,null,"電話番号"]
[]
[]
["※１（押印省略）自署の場合または確認欄の要件に該当し☑を入れた場合は、押印を省略できます。",null,null,null,null,null,null,null,null,null,null,null,null,null,null,null,null,null,null,null,null,null,null,null,null,null,null,null,null,null,null,null,null,null,null,null,null,null,null,"事業主確認欄（以下の内容に該当する場合は、事業主にて確認し☑願います）"]
["この届出については、①または②の要件を満たしたものです。\n①申請者本人（被保険者）が作成したものです。②記載内容について誤りがないか申請者本人が確認しています。",null,null,null,null,null,null,null,null,null,null,null,null,null,null,null,null,null,null,null,null,null,null,null,null,null,null,null,null,null,null,null,null,"確認欄","□",null,null,null,null,"　被保険者との続柄に関する証明書類が省略されている者については、続柄を確認しています。（内縁関係は省略不可）",null,null,null,null,null,null,null,null,null,null,null,null,null,null,null,"確認欄","□"]
[]
["被\n\n保\n\n険\n\n者\n\n記\n\n入\n\n欄","被 保 険 者 番 号",null,null,null,null,null,null,"被保険者　氏名",null,null,null,null,null,null,null,null,null,"被保険者　生年月日",null,null,null,null,null,"所　属（※任意継続被保険者は記入不要）",null,null,null,null,null,null,null,null,null,null,null,null,"被　保　険　者　住　民　票　住　所"]
{"$rows_left_out":42}
{"sheet":"扶養（増）記入例","index":4,"n_rows":61,"n_cols":57,"rows_kept":61,"cut":false,"hidden":false,"merged":[[23,50,23,56],[53,26,53,56],[54,1,55,25],[57,26,57,56],[51,2,51,25],[52,2,52,25],[43,28,43,31],[44,1,46,25],[37,51,43,51],[39,11,40,11],[39,13,39,16],[37,14,38,20],[37,21,38,25],[37,26,38,27],[39,28,40,31],[39,32,40,32],[39,33,43,34],[40,12,40,25],[41,13,41,16],[41,17,41,25],[41,26,42,27],[41,28,42,31],[37,33,38,34],[37,44,43,44],[47,1,50,25],[39,1,43,5],[39,6,43,10],[37,48,43,48],[37,49,43,49],[37,50,43,50],[30,14,31,20],[32,6,36,10],[33,12,33,25],[34,11,35,11],[34,13,34,16],[34,17,34,25],[35,12,35,25],[30,49,36,49],[30,26,31,27],[30,28,31,31],[30,32,31,32],[30,33,31,34],[30,51,36,51],[30,52,30,56],[31,52,36,56],[39,17,39,25],[39,26,40,27],[37,52,37,56],[38,52,43,56],[30,48,36,48],[37,45,43,45],[37,46,43,46],[30,35,41,43],[30,44,36,44],[32,32,33,32],[32,33,36,34],[30,50,36,50],[42,12,42,25],[37,47,43,47],[42,35,43,43],[32,13,32,16],[32,17,32,25],[32,26,33,27],[32,28,33,31],[30,45,36,45],[30,46,36,46],[30,47,36,47],[43,11,43,13],[43,26,43,27],[41,11,42,11],[32,11,33,11],[41,32,42,32],[37,32,38,32],[30,21,31,25],[34,32,35,32],[37,28,38,31],[34,26,35,27],[34,28,35,31],[36,11,36,13],[36,26,36,27],[36,28,36,31],[37,1,38,5],[37,6,38,10],[37,11,38,11],[37,12,38,13],[30,1,31,5],[30,6,31,10],[30,11,31,11],[30,12,31,13],[32,1,36,5],[25,33,29,43],[25,44,28,50],[25,51,29,56],[26,15,26,16],[26,17,26,18],[26,19,26,20],[27,11,27,25],[29,45,29,46],[29,47,29,48],[29,49,29,50],[25,11,26,11],[25,12,26,13],[25,14,25,20],[25,21,26,25],[25,26,27,32],[20,7,24,7],[20,8,24,15],[20,16,24,17],[28,1,28,10],[28,11,29,25],[28,26,29,27],[28,28,29,32],[29,1,29,5],[29,6,29,10],[25,1,27,10],[16,0,16,36],[16,39,16,56],[17,0,17,32],[17,34,17,36],[17,39,17,54],[19,0,59,0],[19,1,19,7],[19,8,19,17],[19,18,19,23],[19,24,19,36],[20,18,24,23],[20,24,24,36],[20,38,20,42],[21,37,21,56],[22,37,22,56],[23,38,23,42],[24,37,24,56],[19,37,19,56],[20,1,24,1],[20,2,24,2],[20,3,24,3],[20,4,24,4],[20,5,24,5],[20,6,24,6],[1,0,2,6],[1,7,2,38],[1,39,1,56],[2,50,2,56],[4,0,4,11],[4,13,4,17],[4,19,5,37],[4,50,4,56],[5,0,5,3],[5,4,5,7],[5,8,5,11],[5,39,5,41],[44,26,46,56],[47,26,52,56],[54,27,55,56],[56,12,58,23],[56,27,56,56],[58,26,59,56],[60,26,60,45],[60,51,60,56],[0,39,0,56],[9,19,12,20],[9,39,9,41],[11,39,11,41],[11,54,12,55],[12,39,12,41],[13,0,14,15],[13,30,13,31],[13,39,13,41],[6,19,7,26],[7,27,11,28],[7,39,7,41],[8,19,8,20],[8,21,8,22],[8,23,8,24],[8,25,8,26]]}
[null,null,null,null,null,null,null,null,null,null,null,null,null,null,null,null,null,null,null,null,null,null,null,null,null,null,null,null,null,null,null,null,null,null,null,null,null,null,null,"事 業 主 （ 事 業 主 代 理 人 ） 記 入 箇 所"]
["取扱注意",null,null,null,null,null,null,"　　　健康保険被扶養者異動届（扶養するとき）",null,null,null,null,null,null,null,null,null,null,null,null,null,null,null,null,null,null,null,null,null,null,null,null,null,null,null,null,null,null,null,"下記の通り被保険者から被扶養者の届出がありましたので提出します。"]
[null,null,null,null,null,null,null,null,null,null,null,null,null,null,null,null,null,null,null,null,null,null,null,null,null,null,null,null,null,null,null,null,null,null,null,null,null,null,null,null,null,null,null,null,null,null,null,null,null,null,"　　　令和　　　　　年　　　　　月　　　　　日　　提出"]
[null,null,null,null,null,null,null,null,null,null,null,null,null,null,null,null,null,null,null,null,null,null,null,null,null,null,null,null,null,null,null,null,null,null,null,null,null,null,null,null,null,null,null,"〒　　　　　　　　－"]
["健 康 保 険 組 合",null,null,null,null,null,null,null,null,null,null,null,null,"健保受付",null,null,null,null,null,"健　康　保　険　組　合　　記　入　欄"]
["　　　　長",null,null,null,"　　　　長",null,null,null,"担当者"]
[null,null,null,null,null,null,null,null,null,null,null,null,null,null,null,null,null,null,null,"異動年月日"]
[null,null,null,null,null,null,null,null,null,null,null,null,null,null,null,null,null,null,null,null,null,null,null,null,null,null,null,"補\n記\n事\n項",null,null,null,null,null,null,null,null,null,null,null,"事業所所在地"]
[null,null,null,null,null,null,null,null,null,null,null,null,null,null,null,null,null,null,null,"号",null,"年",null,"月",null,"日"]
[null,null,null,null,null,null,null,null,null,null,null,null,null,null,null,null,null,null,null,"Ｈ\n\nＲ",null,null,null,null,null,null,null,null,null,null,null,null,null,null,null,null,null,null,null,"事業所名称"]
[]
[null,null,null,null,null,null,null,null,null,null,null,null,null,null,null,null,null,null,null,null,null,null,null,null,null,null,null,null,null,null,null,null,null,null,null,null,null,null,null,"事業主氏名"]
[]
["関西電力健康保険組合　常務理事　殿",null,null,null,null,null,null,null,null,null,null,null,null,null,null,null,null,null,null,null,null,null,"万円","×",null,null,"＝",null,null,null,"万円",null,"/2＝",null,null,null,null,null,null,"電話番号"]
[]
[]
["※１（押印省略）自署の場合または確認欄の要件に該当し☑を入れた場合は、押印を省略できます。",null,null,null,null,null,null,null,null,null,null,null,null,null,null,null,null,null,null,null,null,null,null,null,null,null,null,null,null,null,null,null,null,null,null,null,null,null,null,"事業主確認欄（以下の内容に該当する場合は、事業主にて確認し☑願います）"]
["この届出については、①または②の要件を満たしたものです。\n①申請者本人（被保険者）が作成したものです。②記載内容について誤りがないか申請者本人が確認しています。",null,null,null,null,null,null,null,null,null,null,null,null,null,null,null,null,null,null,null,null,null,null,null,null,null,null,null,null,null,null,null,null,"確認欄","□",null,null,null,null,"　被保険者との続柄に関する証明書類が省略されている者については、続柄を確認しています。（内縁関係は省略不可）",null,null,null,null,null,null,null,null,null,null,null,null,null,null,null,"確認欄","□"]
[]
["被\n\n保\n\n険\n\n者\n\n記\n\n入\n\n欄","被 保 険 者 番 号",null,null,null,null,null,null,"被保険者　氏名",null,null,null,null,null,null,null,null,null,"被保険者　生年月日",null,null,null,null,null,"所　属（※任意継続被保険者は記入不要）",null,null,null,null,null,null,null,null,null,null,null,null,"被　保　険　者　住　民　票　住　所"]
{"$rows_left_out":41}